{"text_format":"1","workbook":"xlsx","n_sheets":7,"sheets":["Калькулятор лизинга","Аннуитетное (с ндс)","Равномерное","Персональный","Кредит аннуитет","Кредит равномерное","Лист2"],"not_rendered":{"charts":0,"images":8,"macros":1,"external_links":0,"defined_names":1,"comments":0,"pivot_tables":0},"unopened":[],"bounds":{"document_bytes":16777216,"sheet_cells":100000,"rows_first":2000,"rows_last":500,"rows_between":2000,"halvings":0,"cell_chars":16384,"cell_head_chars":4096},"cells_cut":0,"cells_raw":0,"read":"whole","date_system":"1900"}

{"sheet":"Калькулятор лизинга","index":0,"n_rows":265,"n_cols":34,"rows_kept":265,"cut":false,"hidden":false,"merged":[[26,5,28,7],[26,10,28,11],[38,8,38,10],[68,14,71,20],[64,14,67,20],[60,14,63,20],[26,1,28,2],[38,11,38,13],[17,14,19,16],[26,3,28,4],[57,11,58,13],[57,5,58,7],[54,11,55,13],[54,5,55,7],[51,11,52,13],[51,5,52,7],[54,8,55,10],[57,8,58,10],[51,8,52,10],[23,12,25,13],[23,14,25,16],[20,14,22,16],[47,5,49,7],[35,5,35,7],[20,1,22,2],[20,10,22,11],[23,10,25,11],[15,3,16,4],[17,3,19,4],[17,5,19,7],[17,1,19,2],[15,5,16,7],[23,3,25,4],[23,5,25,7],[23,1,25,2],[29,14,30,16],[68,1,71,4],[40,1,41,4],[60,1,62,4],[54,1,55,4],[57,1,58,4],[64,1,66,4],[47,1,49,4],[51,1,52,4],[43,1,45,4],[64,5,66,7],[60,5,62,7],[64,8,66,10],[68,8,71,10],[43,5,45,7],[40,11,41,13],[40,5,41,7],[36,5,37,7],[32,11,34,13],[68,11,71,13],[68,5,71,7],[64,11,66,13],[1,23,2,25],[1,27,2,29],[1,32,2,34],[60,8,62,10],[60,11,62,13],[47,11,49,13],[35,8,35,10],[35,11,35,13],[36,8,37,10],[36,11,37,13],[15,14,16,16],[17,10,19,11],[47,8,49,10],[32,8,34,10],[40,8,41,10],[20,12,22,13],[26,14,28,16],[26,12,28,13],[43,8,45,10],[43,11,45,13],[4,7,5,9],[6,7,7,9],[4,10,5,12],[6,10,7,12],[73,10,80,13],[3,23,3,25],[15,1,16,2],[35,1,37,4],[38,5,38,7],[29,3,30,4],[29,12,30,13],[29,10,30,11],[29,1,30,2],[29,5,30,7],[33,5,34,7],[38,1,38,4],[20,3,22,4],[20,5,22,7],[4,4,5,6],[10,7,11,9],[10,10,11,12],[15,12,16,13],[13,12,13,16],[13,3,13,7],[8,10,9,12],[8,7,9,9],[8,4,9,6],[17,12,19,13]]}
[]
[null,null,null,null,null,null,null,null,null,null,null,null,null,null,null,null,null,null,null,null,null,null,null,"ПЕРСОНАЛЬНЫЙ ГРАФИК ПЛАТЕЖЕЙ ПО ЛИЗИНГУ",null,null,null,"ГРАФИК ПЛАТЕЖЕЙ ПО ЛИЗИНГУ",null,null,null,null,"ГРАФИК ПЛАТЕЖЕЙ ПО КРЕДИТУ"]
[]
[null,null,null,null,null,null,null,null,null,null,null,null,null,null,null,null,null,null,null,null,null,null,null,"внесите размер платежей"]
[null,null,null,null,"полная стоимость с НДС",null,null,"Стоимость оборудования, руб.",null,null,4190000,null,null,null,null,null,null,null,null,null,null,null,null,1,50000,null,null,1,{"$f":"IF(AB5<=$F$16,IF($F$18=Лист2!$A$2,'Аннуитетное (с ндс)'!N11,IF('Калькулятор лизинга'!$F$18=Лист2!$A$3,Равномерное!N10,'Калькулятор лизинга'!Y5)),\"\")","v":50000},null,null,null,1,{"$f":"IF(AG5<=$O$16,IF($O$18=Лист2!$A$2,'Кредит аннуитет'!M10,'Кредит равномерное'!M10),\"\")","v":116999.41666666667}]
[null,null,null,null,null,null,null,null,null,null,null,null,null,null,null,null,null,null,null,null,null,null,null,{"$f":"IF(X5<$F$16,X5+1,\"\")","v":2},50000,null,null,{"$f":"IF(AB5<$F$16,AB5+1,\"\")","v":2},{"$f":"IF(AB6<=$F$16,IF($F$18=Лист2!$A$2,'Аннуитетное (с ндс)'!N12,IF('Калькулятор лизинга'!$F$18=Лист2!$A$3,Равномерное!N11,'Калькулятор лизинга'!Y6)),\"\")","v":50000},null,null,null,{"$f":"IF(AG5<$O$16,AG5+1,\"\")","v":2},{"$f":"IF(AG6<=$O$16,IF($O$18=Лист2!$A$2,'Кредит аннуитет'!M11,'Кредит равномерное'!M11),\"\")","v":116998.69902618931}]
[null,null,null,null,null,null,null,"Система налогообложения",null,null," ОСН",null,null,null,null,null,null,null,null,null,null,null,null,{"$f":"IF(X6<$F$16,X6+1,\"\")","v":3},50000,null,null,{"$f":"IF(AB6<$F$16,AB6+1,\"\")","v":3},{"$f":"IF(AB7<=$F$16,IF($F$18=Лист2!$A$2,'Аннуитетное (с ндс)'!N13,IF('Калькулятор лизинга'!$F$18=Лист2!$A$3,Равномерное!N12,'Калькулятор лизинга'!Y7)),\"\")","v":50000},null,null,null,{"$f":"IF(AG6<$O$16,AG6+1,\"\")","v":3},{"$f":"IF(AG7<=$O$16,IF($O$18=Лист2!$A$2,'Кредит аннуитет'!M12,'Кредит равномерное'!M12),\"\")","v":116997.95492542566}]
[null,null,null,null,null,null,null,null,null,null,null,null,null,null,null,null,null,null,null,null,null,null,null,4,50000,null,null,4,{"$f":"IF(AB8<=$F$16,IF($F$18=Лист2!$A$2,'Аннуитетное (с ндс)'!N14,IF('Калькулятор лизинга'!$F$18=Лист2!$A$3,Равномерное!N13,'Калькулятор лизинга'!Y8)),\"\")","v":50000},null,null,null,4,{"$f":"IF(AG8<=$O$16,IF($O$18=Лист2!$A$2,'Кредит аннуитет'!M13,'Кредит равномерное'!M13),\"\")","v":116997.18338875246}]
[null,null,null,null,"определяется автоматически исходя из налогообложения",null,null,"Налог на прибыль, %",null,null,{"$f":"VLOOKUP(K7,Лист2!C2:D10,2,)","v":20},null,null,null,null,null,null,null,null,null,null,null,null,5,50000,null,null,5,{"$f":"IF(AB9<=$F$16,IF($F$18=Лист2!$A$2,'Аннуитетное (с ндс)'!N15,IF('Калькулятор лизинга'!$F$18=Лист2!$A$3,Равномерное!N14,'Калькулятор лизинга'!Y9)),\"\")","v":50000},null,null,null,5,{"$f":"IF(AG9<=$O$16,IF($O$18=Лист2!$A$2,'Кредит аннуитет'!M14,'Кредит равномерное'!M14),\"\")","v":116996.38340457399}]
[null,null,null,null,null,null,null,null,null,null,null,null,null,null,null,null,null,null,null,null,null,null,null,6,50000,null,null,6,{"$f":"IF(AB10<=$F$16,IF($F$18=Лист2!$A$2,'Аннуитетное (с ндс)'!N16,IF('Калькулятор лизинга'!$F$18=Лист2!$A$3,Равномерное!N15,'Калькулятор лизинга'!Y10)),\"\")","v":50000},null,null,null,6,{"$f":"IF(AG10<=$O$16,IF($O$18=Лист2!$A$2,'Кредит аннуитет'!M15,'Кредит равномерное'!M15),\"\")","v":116995.5539239958}]
{"$rows_left_out":256}
{"sheet":"Аннуитетное (с ндс)","index":1,"n_rows":190,"n_cols":23,"rows_kept":190,"cut":false,"hidden":true,"merged":[[5,22,6,22],[24,0,24,2],[26,0,26,2],[10,0,10,2],[11,0,11,2],[12,0,12,2],[13,0,13,2],[14,0,14,2],[5,6,6,6],[5,8,5,9],[5,10,6,10],[5,16,6,16],[5,13,6,13],[21,0,21,2],[5,19,6,19],[5,21,6,21],[5,20,6,20],[17,0,17,2],[23,0,23,2],[5,17,6,17],[5,15,6,15],[5,18,6,18],[16,0,16,2],[29,0,29,2],[27,0,27,2],[5,11,6,11],[5,12,6,12],[5,14,6,14],[20,0,20,2],[18,0,18,2],[19,0,19,2],[22,0,22,2],[15,0,15,2]]}
[null,null,null,null,null,null,null,null,null,null,null,"ЛП облагается НДС",null,null,null,"НДС возмещается по ОС и ЛП (по мере платежей)",null,null,null,null,"В расходы идет весь ЛП без НДС"]
[]
[null,null,null,null,null,null,"ЧИСТВНДОХ",null,null,null,null,null,{"$f":"XIRR(M10:M190,H10:H190)","v":0.54395845532417297},{"$f":"XIRR(N10:N190,H10:H190)","v":0.54544774889946002},null,null,{"$f":"XIRR(Q10:Q190,H10:H190)","v":0.36369474530220036},{"$f":"XIRR(R10:R190,H10:H190)","v":0.36500391364097595},null,null,{"$f":"XIRR(U10:U190,H10:H190)","v":0.20510291457176211},{"$f":"XIRR(V10:V190,H10:H190)","v":0.20605414509773257}]
[null,null,null,null,null,null,null,null,{"$f":"SUM(I8:I190)","v":3491666.6666666712},{"$f":"SUM(J8:J190)","v":698333.33333333395},{"$f":"SUM(K8:K190)","v":4561133.3333333274},{"$f":"SUM(L8:L190)","v":912226.66666666593},{"$f":"SUM(M8:M190)-M10-M9","v":9664360},{"$f":"SUM(N8:N190)-N10-N9","v":9676730.4402410444},null,{"$f":"SUM(P8:P190)-P10-P9","v":1610726.6666666679},{"$f":"SUM(Q8:Q190)-Q10-Q9","v":7844133.333333334},{"$f":"SUM(R8:R190)-R10-R9","v":7856503.7735743793},{"$f":"SUM(S8:S190)","v":1610726.6666666679},{"$f":"SUM(T8:T190)","v":1613200.6111867805},{"$f":"SUM(U8:U190)-U10-U9","v":5395406.666666666},{"$f":"SUM(V8:V190)-V10-V9","v":5405303.1623875964},{"$f":"SUM(W8:W190)","v":12370.440241046201}]
[null,null,null,null,null,null,null,null,null,null,"Ост ст-ть*% в мес"]
[null,null,null,null,null,null,"Платеж",null,"Погашение стоимости имущества",null,"Процент по ставке","НДС по процентам","Лизинговый платеж","Лизинговый платеж со страхованием","Остаточная стоимость имущества","Возмещение НДС","Поток без НДС","Поток без НДС со страхованием","Экономия НП от%","Экономия НП от% и страхования","Поток без НДС и НП","Поток без НДС и НП со страхованием","Страхование"]
[null,null,null,null,null,null,null,null,"без НДС","НДС"]
[null,null,null,null,null,null,"Аванс","2020-01-01",{"$f":"D19-J8","v":1047500},{"$f":"D19*$D$21/(1+$D$21)","v":209500},null,null,{"$f":"SUM(I8:J8)","v":1257000},{"$f":"M8","v":1257000},{"$f":"D11-J8-I8","v":2933000},{"$f":"IF($D$32=\"нет\",0,J8)","v":209500},{"$f":"M8-P8","v":1047500},{"$f":"Q8","v":1047500},{"$f":"IF($D$33=\"да\",Q8*$D$22,0)","v":209500},{"$f":"IF($D$33=\"да\",R8*$D$22,0)","v":209500},{"$f":"IF($D$33=\"да\",Q8*$D$22,0)","v":209500},{"$f":"U8","v":209500}]
[null,null,null,null,null,"в конце","Выкупная стоимость",null,null,null,null,null,{"$f":"D20","v":1000}]
[null,null,null,null,null,null,0,"2020-01-01",null,null,null,null,{"$f":"-(D11-M8)","v":-2933000},{"$f":"M10","v":-2933000},null,null,{"$f":"M10","v":-2933000},{"$f":"Q10","v":-2933000},null,null,{"$f":"Q10","v":-2933000},{"$f":"U10","v":-2933000}]
{"$rows_left_out":181}
{"sheet":"Равномерное","index":2,"n_rows":189,"n_cols":23,"rows_kept":189,"cut":false,"hidden":true,"merged":[[4,20,5,20],[4,22,5,22],[4,6,5,6],[4,8,4,9],[4,10,5,10],[4,15,5,15],[4,16,5,16],[4,14,5,14],[4,12,5,12],[4,11,5,11],[4,18,5,18],[4,13,5,13],[4,17,5,17],[4,19,5,19],[4,21,5,21],[9,0,9,2],[10,0,10,2],[11,0,11,2],[12,0,12,2],[13,0,13,2],[14,0,14,2],[15,0,15,2],[16,0,16,2],[17,0,17,2],[18,0,18,2],[19,0,19,2],[26,0,26,2],[20,0,20,2],[23,0,23,2],[24,0,24,2],[22,0,22,2],[21,0,21,2]]}
[]
[]
[null,null,null,null,null,null,"ЧИСТВНДОХ",null,null,null,null,null,{"$f":"XIRR(M9:M189,H9:H189)","v":{"$error":"#NUM!"}},{"$f":"XIRR(N9:N189,H9:H189)","v":{"$error":"#NUM!"}},null,null,{"$f":"XIRR(Q9:Q189,H9:H189)","v":{"$error":"#NUM!"}},{"$f":"XIRR(R9:R189,H9:H189)","v":{"$error":"#NUM!"}},null,null,{"$f":"XIRR(U9:U189,H9:H189)","v":{"$error":"#NUM!"}},{"$f":"XIRR(V9:V189,H9:H189)","v":{"$error":"#NUM!"}}]
[null,null,null,null,null,null,null,null,{"$f":"SUM(I7:I189)","v":3491666.6666666716},{"$f":"SUM(J7:J189)","v":698333.33333333198},{"$f":"SUM(K7:K189)","v":10415956789.583336},{"$f":"SUM(L7:L189)","v":2083191357.9166675},{"$f":"SUM(M7:M189)-M9-M8","v":12503339147.500002},{"$f":"SUM(N7:N189)-N9-N8","v":12503348068.708338},null,{"$f":"SUM(P7:P189)-P8","v":2083889857.9166675},{"$f":"SUM(Q7:Q189)-Q9-Q8","v":10419239789.583336},{"$f":"SUM(R7:R189)-R9-R8","v":10419248710.791666},{"$f":"SUM(S7:S189)-S8","v":2083847957.9166675},{"$f":"SUM(T7:T189)-T8","v":2083849742.1583333},{"$f":"SUM(U7:U189)-U9-U8","v":8334553831.6666698},{"$f":"SUM(V7:V189)-V9-V8","v":8334560968.6333332},{"$f":"SUM(W7:W189)-W8","v":8921.2083333333358}]
[null,null,null,null,null,null,"Платеж",null,"Погашение стоимости имущества",null,"Процент по ставке","НДС по процентам","Лизинговый платеж","Лизинговый платеж со страхованием","Остаточная стоимость имущества","Возмещение НДС","Поток без НДС","Поток без НДС со страхованием","Экономия НП от%","Экономия НП от% и страхования","Поток без НДС и НП","Поток без НДС и НП со страхованием","Страхование"]
[null,null,null,null,null,null,null,null,"без НДС","НДС"]
[null,null,null,null,null,null,"Аванс",null,{"$f":"D18-J7","v":1047500},{"$f":"D18*$D$20/(1+$D$20)","v":209500},null,null,{"$f":"SUM(I7:J7)","v":1257000},{"$f":"M7","v":1257000},{"$f":"D10-J7-I7","v":2933000},{"$f":"IF($D$31=\"нет\",0,J7)","v":209500},{"$f":"M7-P7","v":1047500},{"$f":"Q7","v":1047500},{"$f":"IF($D$32=\"да\",Q7*$D$21,0)","v":209500},{"$f":"IF($D$32=\"да\",R7*$D$21,0)","v":209500},{"$f":"IF($D$32=\"да\",Q7*$D$21,0)","v":209500},{"$f":"U7","v":209500}]
[null,null,null,null,null,"в конце","Выкупная стоимость",null,null,null,null,null,{"$f":"D19","v":1000}]
[null,null,null,null,null,null,0,"2020-01-01",null,null,null,null,{"$f":"-(D10-D18)","v":-2933000},{"$f":"M9","v":-2933000},null,null,{"$f":"M9","v":-2933000},{"$f":"Q9","v":-2933000},null,null,{"$f":"Q9","v":-2933000},{"$f":"U9","v":-2933000}]
["Стоимость оборудования",null,null,{"$f":"'Калькулятор лизинга'!K5","v":4190000},null,null,1,"2020-02-01",{"$f":"IF(G10<=$D$13,$O$7/$D$13/(1+$D$20),0)","v":33946.759259259263},{"$f":"IF(G10<=$D$13,I10*$D$20,0)","v":6789.3518518518531},{"$f":"IF(G10<=$D$13,O7*$D$16,0)","v":285368679.16666669},{"$f":"IF(G10<=$D$13,K10*$D$20,0)","v":57073735.833333343},{"$f":"IF(G10<=$D$13,SUM(I10:L10),0)+IF(G10=$D$13,$D$19,0)","v":342483151.11111116},{"$f":"M10+W10","v":342483395.52777785},{"$f":"IF(G10<=$D$13,O7-I10-J10,0)","v":2892263.888888889},{"$f":"IF($D$31=\"нет\",0,J10+L10+IF(G10=$D$13,$D$19*$D$20/(1+$D$20),0))","v":57080525.185185194},{"$f":"IF(G10<=$D$13,M10-P10,0)-P7","v":285193125.92592597},{"$f":"Q10+W10","v":285193370.34259266},{"$f":"IF($D$32=\"да\",Q10*$D$21,0)","v":57038625.185185194},{"$f":"IF($D$32=\"да\",R10*$D$21,0)","v":57038674.068518534},{"$f":"Q10-S10-T7","v":227945000.74074078},{"$f":"R10-T10-T7","v":227945196.27407414},{"$f":"IF(G10<=$D$13,$D$22*O7)","v":244.41666666666666}]
{"$rows_left_out":180}
{"sheet":"Персональный","index":3,"n_rows":186,"n_cols":12,"rows_kept":186,"cut":false,"hidden":true,"merged":[]}
[]
[null,null,{"$f":"XIRR(C6:C186,A6:A186,)","v":-0.21917076781392103},null,{"$f":"XIRR(E6:E186,A6:A186,)","v":-0.3212141625583172},"ЭП",{"$f":"XIRR(G6:G186,A6:A186,)","v":-0.37471067383885392},null,"возмещение ндс",{"$f":"VLOOKUP('Калькулятор лизинга'!K7,Лист2!C2:E10,3,)","v":"да"},"страхование",{"$f":"'Калькулятор лизинга'!F30/100/12","v":8.3333333333333331E-5}]
[null,null,{"$f":"SUM(C7:C186)+C5","v":3208000},{"$f":"SUM(D7:D186)+D5","v":534666.66666666674},{"$f":"SUM(E7:E186)+E5","v":2673333.333333334},{"$f":"SUM(F5:F186)","v":534666.6666666664},null,null,"учет расходов",{"$f":"VLOOKUP('Калькулятор лизинга'!K7,Лист2!C2:F10,4,)","v":"да"}]
[null,null,"Лизинговый платеж","Возмещение НДС","Поток без НДС","Экономия НП","Поток без НДС и НП"]
["Аванс",null,{"$f":"IF('Калькулятор лизинга'!D24=Лист2!L2,'Калькулятор лизинга'!K5*'Калькулятор лизинга'!F24/100,'Калькулятор лизинга'!F24)","v":1257000},{"$f":"IF($J$2=\"нет\",0,C5*'Калькулятор лизинга'!K11/(100+'Калькулятор лизинга'!K11))","v":209500},{"$f":"C5-D5","v":1047500},{"$f":"IF($J$3=\"да\",E5*'Калькулятор лизинга'!$K$9/100,0)","v":209500}]
["2020-01-01",null,{"$f":"-('Калькулятор лизинга'!K5-C5)","v":-2933000},null,{"$f":"C6-D5","v":-3142500},null,{"$f":"E6+F5","v":-2933000}]
["2020-02-01",1,{"$f":"IF(B7<='Калькулятор лизинга'!$F$16,'Калькулятор лизинга'!Y5,0)+IF(B7='Калькулятор лизинга'!$F$16,'Калькулятор лизинга'!$F$27)","v":50000},{"$f":"IF($J$2=\"нет\",0,C7*'Калькулятор лизинга'!$K$11/(100+'Калькулятор лизинга'!$K$11))","v":8333.3333333333339},{"$f":"C7-D7","v":41666.666666666664},{"$f":"IF($J$3=\"да\",E7*'Калькулятор лизинга'!$K$9/100,0)","v":8333.3333333333321},{"$f":"E7-F7","v":33333.333333333328}]
["2020-03-01",2,{"$f":"IF(B8<='Калькулятор лизинга'!$F$16,'Калькулятор лизинга'!Y6,0)+IF(B8='Калькулятор лизинга'!$F$16,'Калькулятор лизинга'!$F$27)","v":50000},{"$f":"IF($J$2=\"нет\",0,C8*'Калькулятор лизинга'!$K$11/(100+'Калькулятор лизинга'!$K$11))","v":8333.3333333333339},41666.666666666664,{"$f":"IF($J$3=\"да\",E8*'Калькулятор лизинга'!$K$9/100,0)","v":8333.3333333333321},33333.333333333328]
["2020-04-01",3,{"$f":"IF(B9<='Калькулятор лизинга'!$F$16,'Калькулятор лизинга'!Y7,0)+IF(B9='Калькулятор лизинга'!$F$16,'Калькулятор лизинга'!$F$27)","v":50000},{"$f":"IF($J$2=\"нет\",0,C9*'Калькулятор лизинга'!$K$11/(100+'Калькулятор лизинга'!$K$11))","v":8333.3333333333339},41666.666666666664,{"$f":"IF($J$3=\"да\",E9*'Калькулятор лизинга'!$K$9/100,0)","v":8333.3333333333321},33333.333333333328]
["2020-05-01",4,{"$f":"IF(B10<='Калькулятор лизинга'!$F$16,'Калькулятор лизинга'!Y8,0)+IF(B10='Калькулятор лизинга'!$F$16,'Калькулятор лизинга'!$F$27)","v":50000},{"$f":"IF($J$2=\"нет\",0,C10*'Калькулятор лизинга'!$K$11/(100+'Калькулятор лизинга'!$K$11))","v":8333.3333333333339},41666.666666666664,{"$f":"IF($J$3=\"да\",E10*'Калькулятор лизинга'!$K$9/100,0)","v":8333.3333333333321},33333.333333333328]
{"$rows_left_out":177}
{"sheet":"Кредит аннуитет","index":4,"n_rows":189,"n_cols":28,"rows_kept":189,"cut":false,"hidden":true,"merged":[[5,27,6,27],[5,17,6,17],[5,15,6,15],[5,12,6,12],[5,21,6,21],[5,26,6,26],[5,24,6,24],[25,0,25,2],[16,0,16,2],[17,0,17,2],[5,25,6,25],[5,6,6,6],[5,8,5,9],[5,20,6,20],[5,10,6,10],[5,23,6,23],[5,19,6,19],[5,11,6,11],[5,13,6,13],[5,14,6,14],[5,18,6,18],[5,22,6,22],[5,16,6,16],[28,0,28,2],[30,0,30,2],[31,0,31,2],[34,0,34,2],[27,0,27,2],[7,5,7,6],[23,0,23,2],[18,0,18,2],[19,0,19,2],[20,0,20,2],[10,0,10,2],[11,0,11,2],[12,0,12,2],[13,0,13,2],[14,0,14,2],[15,0,15,2],[21,0,21,2],[22,0,22,2]]}
[null,null,null,null,null,null,null,null,null,null,"На % не начисляется НДС",null,null,null,"НДС на ОС возмещается сразу при постановке на учет",null,null,null,null,null,null,null,"В затраты идет только часть процентов","Амортизация обычная"]
[]
[null,null,null,null,null,null,"ЧИСТВНДОХ",null,null,null,null,{"$f":"XIRR(L9:L189,H9:H189)","v":0.54393768906593321},{"$f":"XIRR(M9:M189,H9:H189)","v":0.54542704224586491},null,null,null,null,null,{"$f":"XIRR(S9:S189,H9:H189)","v":1.0425814986228947},null,{"$f":"XIRR(U9:U189,H9:H189)","v":0.39029864668846137},{"$f":"XIRR(V9:V189,H9:H189)","v":0.39145082831382749},null,null,{"$f":"SUM(W4:Y4)","v":1795350.5306662207},{"$f":"XIRR(Z9:Z189,H9:H189)","v":0.23323543667793276},{"$f":"XIRR(AA9:AA189,H9:H189)","v":0.23408146500587465}]
[null,null,null,null,null,null,null,null,{"$f":"SUM(I8:I189)","v":2444166.6666666702},{"$f":"SUM(J8:J189)","v":488833.33333333407},{"$f":"SUM(K8:K189)","v":5473359.9999999963},{"$f":"SUM(L10:L189)+D19","v":9663360},{"$f":"SUM(M10:M189)+D19","v":9675730.4402410444},null,{"$f":"SUM(O8:O189)","v":698333.33333333337},null,null,null,null,null,null,null,{"$f":"SUM(W10:W189)","v":1094671.9999999988},{"$f":"SUM(X10:X189)","v":698333.33333333279},{"$f":"SUM(Y10:Y189)","v":2345.1973328891245},null,null,{"$f":"SUM(AB10:AB189)","v":12370.440241046201}]
[null,null,null,null,null,null,null,null,null,null,"Ост ст-ть*% в мес"]
[null,null,null,null,null,null,"Платеж",null,"Погашение стоимости имущества",null,"Процент по ставке","Кредитный платеж","Кредитный платеж со страхованием","Основной долг","Возмещение НДС","\"погашение\"","\"процент при НДС\"","\"остаточная стоимость без НДС\"","Поток без НДС","% по ставке ЦБ+3","Поток без НДС","Поток без НДС со страхованием","Экономия налога на прибыль от %","Экономия НП от амортизации","Экономия НП от страхования","Поток без НДС и НП","Поток без НДС и НП со страхованием","Страхование"]
[null,null,null,null,null,null,null,null,"без НДС","НДС"]
[null,null,null,null,null,"Собственные ср-ва",null,null,null,null,null,{"$f":"SUM(I8:J8)","v":0},null,{"$f":"D11-D19","v":2933000},{"$f":"IF($D$37=\"да\",D12,0)","v":698333.33333333337}]
[null,null,null,null,null,null,0,"2020-01-01",null,null,null,{"$f":"-D11+D19","v":-2933000},{"$f":"L9","v":-2933000},null,null,null,null,{"$f":"$D$13","v":3491666.6666666665},{"$f":"L9+O8","v":-2234666.6666666665},null,{"$f":"L9","v":-2933000},{"$f":"U9","v":-2933000},null,null,null,{"$f":"U9","v":-2933000},{"$f":"Z9","v":-2933000}]
[null,null,null,null,null,null,1,"2020-02-01",{"$f":"IF(G10<=$D$14,(L10-K10)*1/(1+$D$20),0)","v":7176.4047735885833},{"$f":"IF(G10<=$D$14,I10*$D$20,0)","v":1435.2809547177167},{"$f":"IF(G10<=$D$14,N8*$D$17,0)","v":108143.3142716937},{"$f":"IF(G10<=$D$14,-$D$29,0)","v":116755},{"$f":"L10+AB10","v":116999.41666666667},{"$f":"IF(G10<=$D$14,N8-I10-J10,0)","v":2924388.3142716936},null,{"$f":"IF(G10<=$D$14,-$E$29-Q10,0)","v":10252.006819412243},{"$f":"IF(G10<=$D$14,R9*$D$17,0)","v":128742.04079963536},{"$f":"IF(G10<=$D$14,R9-P10,0)","v":3481414.6598472544},{"$f":"IF(G10<=$D$14,P10+Q10,0)","v":138994.0476190476},{"$f":"IF(G10<=$D$14,IF($D$37=\"льготное\",K10,N8*($D$24+3%)/12),0)","v":7352.8680555555557},{"$f":"L10-O8","v":-581578.33333333337},{"$f":"M10-O8","v":-581333.91666666674},{"$f":"IF($D$38=\"да\",K10*$D$23,0)","v":21628.662854338741},{"$f":"IF(G10<=$D$21,IF($D$38=\"да\",($D$13)/$D$21*$D$23,0),0)","v":11638.888888888891},{"$f":"IF(G10<=$D$21,IF($D$38=\"да\",AB10*$D$23,0),0)","v":48.883333333333333},{"$f":"U10-W10-X10","v":-614845.88507656101},{"$f":"V10-X10-Y10-W10","v":-614650.35174322769},{"$f":"N8*D24","v":244.41666666666666}]
{"$rows_left_out":180}
{"sheet":"Кредит равномерное","index":5,"n_rows":189,"n_cols":27,"rows_kept":189,"cut":false,"hidden":true,"merged":[[5,20,6,20],[5,25,6,25],[5,23,6,23],[5,24,6,24],[22,0,22,2],[5,22,6,22],[10,0,10,2],[5,13,6,13],[5,14,6,14],[5,10,6,10],[5,11,6,11],[5,17,6,17],[5,18,6,18],[5,21,6,21],[5,16,6,16],[5,15,6,15],[34,0,34,2],[11,0,11,2],[30,0,30,2],[31,0,31,2],[28,0,28,2],[23,0,23,2],[12,0,12,2],[13,0,13,2],[14,0,14,2],[15,0,15,2],[16,0,16,2],[20,0,20,2],[21,0,21,2],[5,19,6,19],[5,6,6,6],[5,8,5,9],[25,0,25,2],[27,0,27,2],[5,12,6,12],[17,0,17,2],[18,0,18,2],[19,0,19,2]]}
[null,null,null,null,null,null,null,null,null,null,"На % не начисляется НДС",null,null,null,"НДС на ОС возмещается сразу при постановке на учет",null,null,null,null,null,null,"В затраты идет только часть процентов, не превышающая ставку ЦБ+ 3","Амортизация обычная"]
[]
[null,null,null,null,null,null,"ЧИСТВНДОХ",null,null,null,null,{"$f":"XIRR(L9:L189,H9:H189)","v":{"$error":"#NUM!"}},{"$f":"XIRR(M9:M189,H9:H189)","v":{"$error":"#NUM!"}},null,null,null,null,{"$f":"XIRR(R9:R189,H9:H189)","v":{"$error":"#NUM!"}},null,{"$f":"XIRR(T9:T189,H9:H189)","v":{"$error":"#NUM!"}},{"$f":"XIRR(U9:U189,H9:H189)","v":{"$error":"#NUM!"}},null,null,{"$f":"SUM(V4:X4)","v":2083640075.4916673},{"$f":"XIRR(Y9:Y189,H9:H189)","v":{"$error":"#NUM!"}},{"$f":"XIRR(Z9:Z189,H9:H189)","v":{"$error":"#NUM!"}}]
[null,null,null,null,null,null,null,null,{"$f":"SUM(I8:I189)","v":2444166.6666666688},{"$f":"SUM(J8:J189)","v":488833.33333333343},{"$f":"SUM(K8:K189)","v":10415956789.583336},{"$f":"SUM(L10:L189)+D19","v":10420146789.583338},{"$f":"SUM(M10:M189)+D19","v":10420155710.791672},null,{"$f":"SUM(O9:O189)","v":698333.33333333337},null,null,{"$f":"SUM(R10:R189)","v":7337098670.4860983},null,null,null,{"$f":"SUM(V8:V189)","v":2083191357.9166675},{"$f":"SUM(W8:W189)","v":446933.33333333279},{"$f":"SUM(X8:X189)","v":1784.241666666667},null,null,{"$f":"SUM(AA8:AA189)","v":8921.2083333333358}]
[null,null,null,null,null,null,null,null,null,null,"Ост ст-ть*% в мес"]
[null,null,null,null,null,null,"Платеж",null,"Погашение стоимости имущества",null,"Процент по ставке","Кредитный платеж","Кредитный платеж со страхованием","Основной долг","Возмещение НДС","\"процент при НДС\"","\"остаточная стоимость без НДС\"","Поток без НДС","% по ставке ЦБ+3","Поток без НДС ","Поток без НДС со страхованием","Экономия налога на прибыль от %","Экономия НП от амортизации","Экономия НП от страхования","Поток без НДС и НП","Поток без НДС и НП со страхованием"]
[null,null,null,null,null,null,null,null,"без НДС","НДС",null,null,null,null,null,null,null,null,null,null,null,null,null,null,null,null,"Страхование"]
[]
[null,null,null,null,null,null,0,"2020-01-01",null,null,null,{"$f":"-D11+D19","v":-2933000},{"$f":"L9","v":-2933000},{"$f":"D11-D19","v":2933000},{"$f":"IF(D37=\"да\",D12,0)","v":698333.33333333337},null,{"$f":"$D$13","v":3491666.6666666665},{"$f":"L9+O9","v":-2234666.6666666665},null,{"$f":"L9","v":-2933000},{"$f":"T9","v":-2933000},null,null,null,{"$f":"T9","v":-2933000},{"$f":"Y9","v":-2933000}]
[null,null,null,null,null,null,1,"2020-02-01",{"$f":"IF(G10<=$D$14,$N$9/$D$14*1/(1+$D$20),0)","v":33946.759259259263},{"$f":"IF(G10<=$D$14,I10*$D$20,0)","v":6789.3518518518531},{"$f":"IF(G10<=$D$14,N9*$D$17,0)","v":285368679.16666669},{"$f":"IF(G10<=$D$14,SUM(I10:K10),0)","v":285409415.27777779},{"$f":"L10+AA10","v":285409659.69444448},{"$f":"IF(G10<=$D$14,N9-I10-J10,0)","v":2892263.888888889},null,{"$f":"IF(G10<=$D$14,Q9*$D$17,0)","v":339724618.05555552},{"$f":"-R9-I10","v":2200719.9074074072},{"$f":"IF(G10<=$D$14,I10+P10,0)","v":339758564.81481481},{"$f":"IF(G10<=$D$14,IF($D$37=\"льготное\",K10,N9*($D$24+3%)/12),0)","v":7352.8680555555557},{"$f":"L10-O9","v":284711081.94444448},{"$f":"M10-O9","v":284711326.36111116},{"$f":"IF($D$38=\"да\",K10*$D$23,0)","v":57073735.833333343},{"$f":"IF($D$38=\"да\",IF(G10<=$D$21,(-$R$9)/$D$21*$D$23,0),0)","v":7448.8888888888896},{"$f":"IF($D$38=\"да\",IF(G10<=$D$14,AA10*$D$23,0),0)","v":48.883333333333333},{"$f":"T10-V10-W10","v":227629897.22222224},{"$f":"U10-W10-X10-V10","v":227630092.7555556},{"$f":"IF(G10<=$D$14,N9*$D$24,0)","v":244.41666666666666}]
{"$rows_left_out":180}
{"sheet":"Лист2","index":6,"n_rows":28,"n_cols":14,"rows_kept":28,"cut":false,"hidden":true,"merged":[]}
["Форма процентов",null,"Налогообложение","налог","НДС","расходы"]
["Аннуитетный",null," ОСН",20,"да","да","Процент по заемным средствам, %",null,null,null,null,"Аванс, %",null,"Собственные средства, %"]
["Дифференцированный",null,"УСН (доход)",6,"нет","нет","Ежемесячный платеж, руб. (только аннуитет)",null,null,null,null,"Аванс, руб.",null,"Собственные средства, руб."]
["Персональный",null,"УСН (доход минус расход)",15,"нет","да"]
[null,null,"ЕНВД","-","нет","нет"]
[null,null,"ЕСХН плательщик НДС",6,"да","да"]
[null,null,"ЕСХН не плательщик НДС",6,"нет","да"]
[null,null,"ПСН","-","нет","нет"]
[null,null,"НПД","4% или 6%","нет","нет"]
[null,null,"НДФЛ (физ. лицо)","-","нет","нет"]
{"$rows_left_out":18}